行业知识
紫光同创 FPGA 开发跳坑指南(四)—— DDR3 控制器 IP 的使用
DDR3 ���一种大容量的存储器件,采用了预取技术和双边沿采样技术,以实现高速数据存储与读取,在视频处理中可以用来缓存 1 帧或多帧图像。
目录
一、紫光 DDR3 IP 的安装
二、紫光 DDR3 IP 的配置
三、DDR3 IP 的使用
3.1 DDR3 写操作
3.2 DDR3 读操作
一、紫光 DDR3 IP 的安装
在 Pango Design Suit 中,选择 Tools -> IP Compiler,菜单栏选择 File -> Update...,在弹出来的窗口中点击 Add Packages,选择 iar 文件。
勾选 IP,点击 Install。
左侧 IP 列表中出现 Logos HMEMC (1.0) 就说明安装完成了。
二、紫光 DDR3 IP 的配置
在刚才的界面中,选中左侧的 Logos HMEMC (1.0),右边填写 Instance Name,然后点击 Customize,进入 DDR3 控制器 IP Core 的配置。
Controller Location 选择 Left(Bank L1 + Bank L2),DDR3 参考时钟频率为 50MHz,数据速率为 800MHz,数据位宽 16bit,可以计算得 DDR3 理论带宽为 1600MB/s.
DDR3 颗粒类型根据实际情况选择,例如 MT41J128M16XX-15E。
选择使能的 AXI 端口与地址排列方式,注意地址 A0 没有用到。
最后是 Summary 界面。
三、DDR3 IP 的使用
Logos HMEMC IP 提供了 3 组 AXI4 接口,3 组接口除了 wdata 和 rdata 位宽不同,其他端口功能与位宽一致。AXI4接口包含五个通道:写地址通道、写数据通道、写响应通道、读地址通道和读数据通道。
(1)写地址通道
| 端口名称 | 输入输出 | 说明 |
| awlen | 输入 | 控制传输的周期数,传输周期的个数为 awlen+1 |
| awsize | 输入 | 控制传输的字节数,一个周期写入 2^awsize 个字节 |
| awburst | 输入 | 突发类型, 00 表示固定、01 表示自增、10 表示循环 |
| awaddr | 输入 | 写地址,位宽为 32bit |
| awvalid | 输入 | 写地址有效 |
| awready | 输出 | 写地址通道有效 |
(2)写数据通道
| 端口名称 | 输入输出 | 说明 |
| wdata | 输入 | 写数据,位宽为 64bit 或 128bit |
| wstrb | 输入 | 写数据选通,位宽为 wdata 的位宽除以 8 |
| wlast | 输入 | 写周期末尾指示 |
| wvalid | 输入 | 写数据有效 |
| wready | 输出 | 写数据通道有效 |
(3)写响应通道
| 端口名称 | 输入输出 | 说明 |
| bresp | 输出 | 写响应数据,位宽为 2bit |
| bvalid | 输出 | 写响应有效 |
| bready | 输入 | 写响应通道有效 |
(4)读地址通道
| 端口名称 | 输入输出 | 说明 |
| arlen | 输入 | 控制传输的周期数,传输周期的个数为 arlen+1 |
| arsize | 输入 | 控制传输的字节数,一个周期读取 2^arsize 个字节 |
| arburst | 输入 | 突发类型, 00 表示固定、01 表示自增、10 表示循环 |
| araddr | 输入 | 读地址,位宽为 32bit |
| arvalid | 输入 | 读地址有效 |
| arready | 输出 | 读地址通道有效 |
(5)读数据通道
| 端口名称 | 输入输出 | 说明 |
| rdata | 输出 | 读数据,位宽为 64bit 或 128bit |
| rresp | 输出 | 读响应数据,位宽为 2bit |
| rlast | 输出 | 读周期末尾指示 |
| rvalid | 输出 | 读数据有效 |
| rready | 输入 | 读数据通道有效 |
3.1 DDR3 写操作
写 DDR3 时,先通过写地址通道发送写地址,再通过写数据通道发送数据,写响应通道信号可以不予理会。
可以用状态机实现 AXI4 写地址和写数据通道的从机接口,实现 DDR3 的写操作。
VHDL 版本
process(sys_rst,ddr3_clk) isbegin if sys_rst = '1' then pstate